UVM断言实战:从机制原理到覆盖率收集的完整指南
1. 断言在UVM验证里的真实地位:为什么光靠scoreboard不够
做验证做到一定年头你就会发现,UVM环境里的scoreboard再怎么精心设计,也只能回答"送进去的数据和比对出来的数据是否一致",它很难回答"这个协议时序是否在恰当的时间窗口内完成"。很多同事早期会把所有检查都堆在scoreboard里,等波形拉出来一看,数据全对,但真正的问题——比如某个握手信号在时钟沿之后才拉高、某个请求在没有准备好时就被接受——早就被scoreboard那双"近视眼"漏掉了。
断言(assertion)恰恰是补这一环的工具。它把设计规格里那些"不可妥协的时序关系"直接变成机器可检查的规则,随着仿真推进逐周期去验证。在UVM实战里,断言不是替代scoreboard,而是和scoreboard形成分工:scoreboard管数据平面的正确性,断言管控制时序平面的正确性。今天这篇就围绕assertion在UVM里的落地方式、常用构造思路、调试经验和覆盖率收集方法展开,适合已经会搭基础UVM环境、但还没系统用过断言的验证工程师参考。
断言和UVM的关系需要先理清。很多人误以为"断言只在纯SystemVerilog模块验证里用",进了UVM就全交给sequence和scoreboard。实际上断言既可以写在接口模块里,也可以通过bind机制绑定到DUT内部信号,完全可以和UVM的virtual interface、report机制无缝衔接。更有意思的是,断言失败能直接进入UVM的报告体系,配上uvm_error,日志里既有数据比对信息,又有协议时序违例信息,排查问题时会省掉大量来回翻波形的时间。
2. 立即断言和并发断言:两个机制、两套适用场景
2.1 立即断言:适合过程代码里的即刻判断
立即断言是最容易理解的一类,它写在过程块里,执行到那一行时立刻判断当前时刻的条件。语法上它带一个标签,比如:
check_valid_ready: assert (ready === 1'b1) else $fatal(0, "ready should be high when valid is high");这行代码放在某个task里,仿真执行到这里会马上计算括号里的表达式。如果结果不为真,就走else分支,上报错误。它的特点就是"即时性"——只检查当前时刻,不能描述跨周期行为。
UVM环境里立即断言最常见的落点是测试平台内部的回调函数,或者是sequence里的时序检查。比如在驱动的driver里,你在发送完一个事务之后立刻检查FIFO的full信号是否被不合理触发,这种单拍条件判断用立即断言最直接。它的好处是侵入性低,写在函数或任务内部,不占用额外进程;坏处是只能覆盖"当前那一拍"的检查,无法表达"两个事件之间的相对关系"。
这里有个经验:立即断言的启动时机完全取决于代码执行路径,如果某个分支没有被执行到,里面的断言也就白白存在。所以它更适合放在一定会经过的公共代码路径中,而不是深埋在某个罕见条件分支里。
2.2 并发断言:跨周期时序检查的主力
并发断言是UVM实战中真正的主角。它和立即断言最大的区别在于,它自带采样时钟,可以跨时钟周期检查事件序列。这个机制底层会生成一个独立的仿真进程,一直跟着时钟沿采样信号,判断属性是否成立。只要属性定义里写了@(posedge clk),它就会自动在每个上升沿评估一次,不管这个过程是从哪个代码块发起的。
最简单的并发断言长这样:
property p_valid_ready; @(posedge clk_sys) valid |-> ready ##1 ack; endproperty ap_check: assert property (p_valid_ready);这段属性描述的是:每个时钟上升沿,如果valid为高,那么在当前拍或下一拍内,ready必须为高,并且再下一拍ack必须为高。这里|->是蕴含算子,前面的valid是前提条件,后面的ready ##1 ack是结论部分,描述一个跨两拍的序列。
实际项目里,并发断言通常被放在接口中,或者是通过bind绑定到DUT内部模块的信号上。它最擅长捕捉协议层面的时序违例,比如读操作后数据必须在若干拍内返回、总线请求不能连续超过N拍、使能信号拉高期间对应数据不能变化等。这类跨周期约束,如果你用scoreboard来检查,得费好大劲去记录历史状态;用并发断言就是几行代码的事。
2.3 采样沿和变化沿:最容易踩坑的时序细节
用并发断言必须随时记着一个原则:采样发生在时钟沿,而信号的跳变在时钟沿附近,采样值取的是沿之前的值。很多新手第一版断言会写错,就是因为忽略了这"一拍的相位差"。看下面的例子:
@(posedge clk) a |-> b;当a在时间T的上升沿被采样为高,那么b必须在下个上升沿到来前保持高。注意这里a的高电平如果是与clk同步变化的,那么a在T沿之前的旧值才是本次采样的对象。仿真器里看到的波形是"沿后变化",但采样逻辑默认使用"沿前稳态值"。
这个细节直接决定了断言能不能过。我自己的经验是,每写一个涉及边沿的断言前,先在纸上画一下波形,标出采样沿落在哪里,再判断条件的到来时刻是否能让采样沿正确捕获。哪怕只是多拍了一个##1,整个时序检查就会完全偏离预期。
3. 把断言塞进UVM环境:接口嵌入和bind绑定两种路径
3.1 直接在interface里声明断言:默认且推荐的做法
UVM环境里最常见的断言位置就是interface。由于virtual interface是UVM组件访问DUT信号的通道,把断言直接写在interface里,意味着断言会和接口信号天然共存,不需要额外接出信号,仿真工具也能自动识别。比如一个简单总线接口,可以写成这样:
interface apb_if(input logic pclk, input logic presetn); logic psel; logic penable; logic pwrite; logic [31:0] pwdata; // APB协议要求:penable不能在没有psel的情况下拉起 property p_penable_requires_psel; @(posedge pclk) disable iff (!presetn) penable |-> psel; endproperty ap_penable_requires_psel: assert property (p_penable_requires_psel); endinterface在UVM的agent里,你通过config_db拿到这个virtual interface后,断言机制已经在后台运行了,完全不需要额外启动线程。这种方式的优点在于:接口封装了信号和协议约束,整个agent复用时会带着断言一起走,换一个测试用例、换一个sequence,断言依然在监控。缺点是接口文件会随着断言数量增加逐渐膨胀,而且如果同一接口被多个DUT实例共用,断言会被重复评估,需要根据具体场景注意是否会产生重复报错。
3.2 bind语法:在不改DUT源码的前提下外挂断言
如果信号不在接口里,而在DUT模块内部,你又不方便修改DUT源码,bind就是最合适的落点。bind的语法是把一个带断言的模块或接口"无形地"挂在另一个模块内部,仿真时就像本来就在那个模块里一样。常见写法:
module dut_assertions( input clk, input rst_n, input req, input grant ); property p_req_grant; @(posedge clk) disable iff (!rst_n) req |=> grant[->1]; endproperty assert property (p_req_grant); endmodule bind dut dut_assertions dut_asserts_inst( .clk(clk), .rst_n(rst_n), .req(req), .grant(grant) );这里的bind dut把断言模块实例化到名为dut的模块内部,所有信号直接连接。它的最大优势是彻底不碰DUT源码,拿到一个第三方的、禁止修改的DUT时,这个方案几乎是唯一选择。但也要注意,bind的模块在编译时会被复制到每个匹配的dut实例中,如果dut被例化了多次,你要想清楚是否真的需要每个实例都检查。另外,bind模块里的initial块和UVM全局进程的关系也要留意,避免在仿真0时刻出现意外的初始化顺序问题。
3.3 断言与UVM组件之间的数据交互
断言虽然不属于UVM组件树,但它能通过interface与UVM组件交互。比如你可以在interface里保留一个状态变量,断言失败时更新它,然后scoreboard在事务处理时查询;或者反过来,sequence在发起激励后,通过采样接口信号判断是否发生了协议违例。
一个比较实用的做法是在断言中调用UVM报告宏。如果断言模块引入了uvm_pkg,那么可以直接写:
import uvm_pkg::*; `include "uvm_macros.svh" property p_req_ack; @(posedge clk) disable iff (rst_n === 0) req |-> ##1 ack; endproperty ap_req_ack: assert property (p_req_ack) else begin `uvm_error(get_full_name(), "req without ack within 1 cycle") end这样断言失败就不再只是仿真的红色标记,而是真正进入UVM的报告机制,能按severity统计、归入对应用例的日志文件,还能配合uvm_report_catcher做后期处理。这一步非常关键,等于把断言和UVM环境彻底打通。
4. 序列与属性的实战构造:从握手协议到多周期复杂场景
4.1 序列构建:理解##延迟和$rose这类系统函数
并发断言的底层是由序列(sequence)串联起来的。序列描述的是信号在一段时间内的变化形式,最常见的延迟符号就是##。##1代表延迟一个时钟周期,##0代表和当前沿重叠,##n代表延迟n个周期。握手场景里,"请求拉起后至少两个周期内必须给响应"这个序列可以写成:
sequence s_req_to_ack; $rose(req) ##1 ack; endsequence这里用$rose(req)检测req信号的上升变化,然后延迟一拍检查ack。$rose这类系统函数的取值也是基于采样沿的,它判断的是"当前采样值等于1,且上一个采样值等于0",这一点要在阅读波形时保持清醒。
序列里还能用*、[->]、[*]这些重复运算符。比如req[*2]表示req连续两个周期为高,grant[->1]表示grant最终出现一次为高,中间不管隔多少拍。多周期检查里,这类语法特别有用,能避免写出又长又脆弱的展开式。
4.2 属性构造:蕴含算子|->和|=>的取舍
有了序列,下一步就是把前提和结论用蕴含算子连接起来构成完整属性。|->是重叠蕴含,含义是"前提在当前沿满足,结论从当前沿开始检查";|=>是非重叠蕴含,前提满足后延迟一拍才开始检查结论。这两者之间差一拍,选错整个断言就失效。
举一个总线读写分离的例子:
property p_read_data_valid; @(posedge clk) rmem_read_req |-> ##2 valid_read_data; endproperty这里rmem_read_req拉高后经过两个周期的延迟,valid_read_data必须为高。如果你希望在这两个周期之间数据不能变化,可以加一个$stable:
property p_read_data_stable; @(posedge clk) rmem_read_req |-> ##1 $stable(rmem_data) ##1 valid_read_data; endproperty$stable是并发断言里最常用的"不变化检查",它本身也按采样沿来计算,检查的是从上一个沿到当前沿之间信号没有变化。
4.3 复位处理:disable iff是断言的第一个安全门
不处理复位的断言在复位期间会疯狂误报。最稳妥的方法是在属性声明中加disable iff。它表示"如果复位条件为真,则暂停当前属性的评估"。这个机制不只是跳过当前沿,连已经进行到一半的序列也会被撤销。
property p_no_x_fifo; @(posedge clk) disable iff (rst_n === 0) fifo_push |-> !fifo_full; endproperty注意disable iff只接受一个布尔表达式,如果你有异步复位和同步复位两套复位信号,就得分别处理。实践中我建议所有断言属性都先写复位条件,再写主体逻辑,这个顺序别反过来。而且,复位条件的本身就容易被误写,比如写成rst_n == 0在工作时也有隐患,因为仿真里x态会破坏比较结果,所以更安全的是rst_n === 0。这个习惯养成之后,能省下大量处理x态误报的时间。
5. 从断言失败到定位问题:一份实用的调试路径
5.1 失败报告的流向设置
断言失败后,默认行为不一定符合你的预期。如果直接在DUT模块里写了assert property,没加任何报告处理,它默认使用的是SystemVerilog的$error,仿真器会在log里打一条消息,同时把波形标红。在UVM环境里,最好统一收敛到UVM报告体系里,这样能配合+UVM_VERBOSITY、uvm_report_catcher这些机制统一管理。
建议的做法是为每个断言单独配置severity,而不是全部用error。例如:
ap_critical_protocol: assert property (p_critical) else `uvm_error("ASSERT", "critical protocol violation, check waveform"); ap_noncritical_hint: assert property (p_hint) else `uvm_warning("ASSERT", "possible performance issue, not fatal");用warning还是error,取决于这条协议约束是否直接影响功能正确性。如果不会直接导致错误的结果,但对性能有影响,用warning可以保留现场,又不让仿真流程被频繁打断。很多人一上来把所有断言都设为error,结果仿真在第一个不痛不痒的违例处就停住,反而漏掉了后面真正的问题。
5.2 日志、波形、时间戳三者结合排查
断言失败时仿真器会在它内部的时间戳记录一笔日志。我在排查时习惯先看日志命中时间,再到波形里把时间窗拉出来,前后各放几个周期的余量。这时候只看断言本身的信号往往找不到根因,因为断言是一个"结果的展示",真正的原因通常在更早的时间点。
比如一个req和ack的握手断言失败,请别只盯着req和ack这两个信号。真正的问题可能在时钟的相位、复位的释放时序、或者是某个信号在0时刻没有初值。我建议在interface里同时把断言涉及的相关信号作为一组波形预先加入一个自定义的wave group里,每次仿真结束直接check那一组信号,效率远高于临时再拖信号。
5.3 断言和scoreboard的排查分工
当断言和scoreboard同时报错,先处理哪一个?我的顺序永远是:先断言,后scoreboard。原因很简单,断言是单点时序检查,定位对象明确,大概率能直接告诉你哪个协议环节出了问题。等协议时序恢复正确后,scoreboard里的数据比对错误通常会自然消失——因为很多数据错位其实是时序错位导致的。
这条经验在维护大型UVM环境时特别有价值。曾经有一回ve里上百个scoreboard比对全挂,排查了两天才发现是一条地址通道的valid比预期早了半拍,断言早就报了,但被我们当成了"无关紧要的warning"忽略了。从那时起,我把所有涉及协议关键路径的断言都改成了error级别。
6. 断言覆盖率的收集:让断言反哺盲区检测
6.1 为什么断言必须配覆盖率统计
断言能告诉你"我发现了违例",但它没法告诉你"我有没有把所有该检查的路径都激活过"。验证里有一个很现实的问题:你的断言写得再漂亮,如果对应的激励路径根本没跑到,断言本身就是一个哑弹。因此,断言覆盖率(assertion coverage)和功能覆盖率一样重要,它衡量的是这些时序属性到底有多少比例被实际触发过。
多数仿真器对assert property是默认收集覆盖率的,数据库里能看到每条断言的命中次数。但如果你写了属性却没有强调覆盖目标,覆盖率报告只会给出简单的pass/fail次数,信息量不大。更合适的做法是显式声明cover property。
6.2 用cover property量化断言行为
cover property可以包在某个属性外面,用来统计"这个属性发生了多少次"。它和assert的区别在于,assert关心的是属性是否一直满足,cover关心的是属性的前提是否被触发过。看这个例子:
property p_seq_req_ack; @(posedge clk) $rose(req) ##1 ack; endproperty ap_seq_req_ack: assert property (p_seq_req_ack); cp_seq_req_ack: cover property (p_seq_req_ack);仿真结束后,如果cp_seq_req_ack的命中数为0,说明这个"req后跟ack"的场景在仿真里根本没发生过。你就要反问:是该场景在当前测试中本就不应该出现,还是激励没有覆盖到?如果应该出现却没出现,这就是一个盲区。
在复杂UVM环境中,建议在回归收集的覆盖率报告里同时导出所有断言的cover统计,和功能覆盖率放在一起看。每次回归跑完,查看那些命中数为零的断言清单,往往会发现一批从未被激活过的协议路径,它们的价值就是告诉你:下个测试用例该往哪个方向写激励。
6.3 实际项目中断言覆盖率的组织建议
不要为每一条小断言单独开一个覆盖率组,那会让报告散乱到没法看。更好的做法是按协议功能域划分几个组,比如一组是"读写握手",一组是"复位时序",一组是"总线仲裁"。每个功能域内的断言不管以assert、cover还是assume存在,都归入对应的组里。UVM里可以通过宏定义或者接口内部的组织方式实现这种归类。
我自己的习惯是,在项目验证计划阶段,先花半天把规格书里"必须满足的时序关系"整理成一张表格,每一条对应一个断言,同时标注该断言覆盖的是正常路径、异常路径还是边界路径。然后每写完一条断言,就在这表格上打一个勾,把对应测试用例的名字一并填上。这样最终覆盖率报告会和验证计划表一一对应,领导问起来也能当场说清楚哪条规格是被哪条断言覆盖的。
这种"先列规格再写断言"的方式比想到哪写到哪高效得多,因为它能让断言和验证计划形成闭环:计划里有哪些要点,代码里就有对应断言,覆盖率报告里就能看到命中率。比起事后再补断言,这样也避免了一堆"查不出任何问题"的无效断言堆在环境里,影响仿真性能也影响代码可读性。
7. 最后说点个人体会
断言的引入会给UVM环境带来一个显著的变化:你不再只依赖scoreboard在事务级别做数据比对,而是能在信号级别的时序窗口内逐周期检查协议正确性。两者的时间精度不一样,各自能捕获的问题类别也完全不同。只有把数据检查和断言时序检查合并使用,验证环境的"分辨率"才算真正够用。
如果你正在把断言引入现有UVM环境,我强烈建议先从最核心的10条协议约束开始,不要贪多。把复位条件、采样沿、蕴含算子这三个基础问题彻底吃透,再逐步扩展到复杂序列。断言写得太多又控制不住severity,很容易让回归日志变得嘈杂,反而掩盖真正的问题。
在跑仿真前,我还习惯专门跑一轮全开关的断言回归,把所有断言都设置成error级别,哪怕误报也要全部爆出来。这样能快速发现哪些断言是在x态下乱报的、哪些断言在边界条件下过于苛刻,然后再根据结果分级。经过这一轮清洗,留在环境里的断言才是有战斗力的。