SVA检查器库应用指南:例化参数、覆盖率分级与回归门禁避坑

发布时间:2026/10/28 4:53:45
SVA检查器库应用指南:例化参数、覆盖率分级与回归门禁避坑

简介:Synopsys_SVA_OVL检查库应用指南面向数字电路验证初学者与需要规范验证流程的工程师,围绕SystemVerilog断言检查库的使用展开,帮助解决验证无章可循、平台复用困难等问题。包内共1个PDF文件,约4.73MB,内容以库单元例化、全局控制、触发条件、VMM报告、定制报告及共享语法等章节组织,并附《A Practical Guide for SystemVerilog Assertions》第一章译文供参考。已有738人学习。读者可据此了解severity_level、options、property_type、msg、category、clk、reset_n等参数的含义,掌握检查器的调用方式与覆盖率报告查看思路,为在验证环境中快速插入标准化检查单元、提升调试与复用效率提供参考。

1. 从一条只有时间戳的失败日志说起

「这条断言到底在查什么?」——经常有人拿着一条回归失败日志来问,日志里只有failed at time 12345ns,没有信号名、没有实例路径、没有分类,只能靠时间戳回波形里倒推,二十分钟就没了。数字电路验证里这种场景不新鲜:SVA 本身写得动,但断言失败时报什么、归到哪一类、覆盖率算到哪一层,全靠各自发挥。SVA 检查器库(沿用 OVL 那套例化风格)把这些事标准化了:时钟、复位、严重度、消息、分类、覆盖率等级全部收进例化参数,一个检查对象就是一行库单元,不必每次从property ... endproperty重新拼。这份应用指南正文把库单元的语法、参数、覆盖率模式和示例逐条摊开,另附一份中文翻译说明。适合刚开始独立承担验证任务的人,也适合手上散着一堆裸断言、想先把风格收编的熟手。

2. 共享语法拆解:九个例化参数怎么一次配齐

检查器库最省事的地方在于它有一套「共享语法」:不管你例化的是assert_always还是assert_fifo_index,前面那一段参数长得几乎一样。反过来说,这一套参数没配对,后面所有检查器都会一起出问题。我第一次用时把severity_level和options的位置记反了,结果一整个晚上的回归全是 info 级别,失败压根没被过滤出来。

2.1 九个共享参数各自的职责

先把这张表背下来,比背检查器名字有用得多。名字以文档里的写法为准,不同版本的头文件里个别宏会有出入。

参数作用常见取值容易踩的地方
severity_level检查失败时报告的严重度info / warning / error / fatal 四档宏全部设成 error,回归里噪声淹没真问题
options位掩码开关,控制打印、覆盖率等行为默认值、静默、关闭覆盖率位或写错会连带关掉消息打印
property_type断言性质:assert / cover / assume按验证意图选把 cover 当 assert 用,覆盖率好看但不报错
msg失败时输出的自定义消息字符串只写「check failed」,等于没写
category分类标签,便于过滤报告自定义整数或宏全填 0,报告无法按模块聚合
coverage_level_i覆盖率分级开关0 / 1 / 2 / 3设了等级但没开收集,报告里是空的
inst_name实例名,进报告和波形字符串留空则报告里只有模块层级,定位慢
clk采样时钟单比特信号接错时钟域,检查器整体偏移一拍
reset_n低有效复位单比特信号极性接反,检查器永远在复位态不工作

options这个参数在实际项目里最容易被忽视。它本质是一组位掩码,某些位控制失败时是否打印调用栈,某些位控制是否参与覆盖率采样。项目里常见的做法是先取库给的默认值宏,只对个别检查器做按位或,别自己拼裸数字——不同版本位定义改过一次,裸数字会悄悄失效。

property_type决定这条检查是「报错」「只记覆盖」还是「约束激励」。用错了不会编译报错,只会让回归结论失真:比如本该报错的地方填了 cover,波形错了但回归是绿的,这种问题排查起来非常难受。

2.2 位置式与具名式:两种写法各有各的活法

文档里每个检查器都给了两套示例,一套位置式,一套基于名称。位置式适合快速验证一个想法,具名式适合进仓库。

// 风格一:位置式。顺序按 clk / reset_n / test_expr / severity / options / msg / category 排列 // 注意:不同库版本端口顺序可能不同,抄之前先打开库的 .sv 头文件核对一遍 assert_never u_no_xz ( aclk, // clk aresetn, // reset_n rdata_has_x, // test_expr:表达式为真即判定失败 `SVA_ERROR, // severity_level `SVA_DEFAULT, // options "rdata 总线不允许出现 X/Z", // msg CAT_BUS // category );

这段的逻辑很直白:assert_never的语义是「表达式在任何被采样的时钟沿上都不许成立」,所以rdata_has_x一旦为真就报错。位置式的问题在于它把端口顺序写死在了代码里,库升级换了参数次序,或者你把severity_level和options写反,编译照样过,行为却变了。所以团队里我一般只允许位置式出现在临时脚本和一次性使用的检查器上。

// 风格二:具名式。参数顺序无关,新增参数不影响已有代码 assert_never #( .severity_level (`SVA_ERROR), .options (`SVA_DEFAULT), .property_type (`SVA_ASSERT), .msg ("rdata 总线不允许出现 X/Z"), .category (CAT_BUS), .coverage_level_i (2), .inst_name ("u_no_xz") ) u_no_xz ( .clk (aclk), .reset_n (aresetn), .test_expr (rdata_has_x) );

具名式的价值不只是「好看」。检查器的参数集在版本之间会增长,位置式一旦少写一个尾部参数,工具会用默认值补上,你以为设置了coverage_level_i=2,实际补的是 0,覆盖率报告里就少了一块。具名式漏写会直接编译报错,把问题挡在前面。代价是代码长,所以更常见的做法是把共享参数收进一个宏。

// 把共享参数收成宏,具名式例化时展开,既短又不丢参数 `define CHK_COMMON(NAME, LVL, MSG, CAT) \ .severity_level(`SVA_``LVL), \ .options (`SVA_DEFAULT), \ .msg (MSG), \ .category (CAT), \ .coverage_level_i (1), \ .inst_name (NAME) // 使用:一行展开六个参数,剩下的 clk / reset_n / test_expr 按需写 assert_always #( `CHK_COMMON("u_rd_stable", ERROR, "读数据在 valid 期间必须稳定", CAT_BUS) ) u_rd_stable ( .clk (aclk), .reset_n (aresetn), .test_expr (!(rvalid && $changed(rdata))) );

宏展开之后仍然是具名参数,所以顺序无关,也不会因为少写而静默使用默认值。代价是可读性下降一档,新人第一次看会愣一下,所以宏定义要放在一个所有人都能找到的文件里,并且注释清楚每个参数是什么。

2.3 时钟与复位:误报率高低主要看这两个端口

检查器是「采样型」的,clk接哪根时钟决定了它看到的世界。一个常见翻车:模块内部有两套时钟,检查器例化在模块顶层却接了自己的主时钟,被测信号其实是另一个域过来的,检查器每次都晚一拍判定,跑出来的失败全是相位差造成的假问题。规矩很简单——检查器接的时钟必须是它所检查信号真正被采样的那根时钟,跨域的检查宁可拆成两个检查器分别挂在两侧,也不要用一个检查器去跨。

reset_n的极性是个小坑。库默认按低有效处理,如果你的设计复位是高有效,直接接上去会让检查器在复位释放后仍然处于复位态,一条错都不报,你不知道是设计没问题还是检查器没工作。这种问题必须靠后文说的「故障注入」自检来暴露。

复位释放的时序也要留意。异步复位在释放沿附近,各信号的初始化顺序并不确定,如果检查器从复位释放后的第一个时钟沿就开始判定,很容易报出一批「还没初始化完」的失败。常见做法是在test_expr里与上一个使能条件,例如!init_done ? 1'b0 : real_check,或者在用enable端口的检查器上把init_done接进去。多花一行,能省掉一整轮排查。

2.4 报告三件套:msg、category、severity 怎么写才有用

msg的写法直接决定排错速度。好用的消息基本是三段式:谁、期望什么、在什么窗口内。比如"axi_rd: rvalid 拉高后 8 拍内必须出现 rready",比"handshake failed"强太多。短消息看着干净,落到回归日志里几百条一起刷,根本对不上是哪条检查。

category是给过滤用的。我一般按总线、存储、控制状态机、时钟复位这几类分,数字大小无所谓,关键是一个模块内的检查器别全填同一个值。回归失败时先按 category 聚合,能一眼看出问题集中在哪一块,而不是一条条翻。

severity_level要敢分级。真正会导致功能错误的检查给 error,协议允许但不推荐的行为给 warning,纯统计性质的给 info。全都设成 error,回归永远是红的一片,久而久之没人看红名单,这比没有断言更危险。分级之后,回归门禁只卡 error 级别,warning 收敛进周报,节奏就顺了。

3. 检查器选型:十七类场景该例化哪一个

库里的检查器名字都很好猜,真正的难点是两件事:需求该落到哪个检查器上,以及选完之后会不会有漏检。这一章按场景把常用检查器过一遍,参数说明只写实际会改的那几个,其余的走共享语法默认值。

3.1 一张按场景检索的对照表

想检查的行为检查器需要关注的关键参数
某个条件每个采样沿都必须成立assert_alwaystest_expr
某个条件永远不许成立(互斥、非法编码、X/Z)assert_nevertest_expr
信号必须在给定窗口内发生变化assert_changenum_cks、start_event
事件 A 之后第 N 拍事件 B 必须成立assert_nextnum_cks、start_event
A 成立则 B 必须成立(蕴含关系)assert_implication前件、后件表达式
只在时钟边沿(或指定边沿)采样assert_always_on_edgeedge
请求与应答的握手时序assert_handshake应答窗口
一段时间窗口内的帧结构assert_frame窗口起止参数
反复出现的循环序列assert_cycle_sequencenum_cks
计数器上溢/下溢assert_no_overflow/assert_no_underflow边界表达式
单次变化量不超过阈值assert_delta变化量阈值
奇偶校验assert_even_parity/assert_odd_parity被校验向量
FIFO 读写指针合法assert_fifo_indexpush / pop 条件
单调递增/递减assert_increment/assert_decrement步长约束
一段时间内不允许翻转assert_no_transition观察窗口

表里最容易选错的是assert_always和assert_implication。前者是「每拍都得真」,后者是「有前件才有后件」,把蕴含写成 always,前件没发生时后件也被强制要求,会造出一堆假失败。

3.2 最常用的四个:always、never、change、next

这四个覆盖了日常七成以上的需求,写法固定,参数少。

// 1) 非法状态编码:状态机里不允许出现的值,任何一拍出现就报错 assert_never #( .severity_level (`SVA_ERROR), .msg ("fsm_state 出现非法编码"), .category (CAT_CTRL) ) u_fsm_illegal ( .clk (clk), .reset_n (rst_n), .test_expr (fsm_state inside {3'b000, 3'b111}) ); // 2) 有效期间数据稳定:valid 拉高时 payload 不许变 assert_always #( .severity_level (`SVA_ERROR), .msg ("payload 在 valid 有效期间发生变化"), .category (CAT_BUS) ) u_payload_stable ( .clk (clk), .reset_n (rst_n), .test_expr (!(valid && $changed(payload))) );

第一段的判定逻辑是「表达式为真即失败」,所以inside里放的是非法集合。第二段相反,assert_always是「表达式为假即失败」,所以里面写的是取反后的合法条件。这两个语义差别值得在团队里专门讲一次,我见过有人把assert_never里也写成合法条件,结果跑了一周绿回归,实际上什么也没检查——因为合法条件当然不会成立。

// 3) 请求后 8 拍内必须应答:next 的核心是 num_cks 窗口 assert_next #( .num_cks (8), .severity_level (`SVA_ERROR), .msg ("req 拉高后 8 拍内未收到 ack"), .category (CAT_BUS) ) u_req_ack ( .clk (clk), .reset_n (rst_n), .start_event (req), .test_expr (ack) ); // 4) 模式切换只能发生在空闲且无挂起事务时 assert_change #( .num_cks (1), .severity_level (`SVA_WARNING), .msg ("ctl_mode 在非 idle 状态下被改写"), .category (CAT_CTRL) ) u_mode_change ( .clk (clk), .reset_n (rst_n), .start_event (mode_wr), .test_expr (idle && !pending) );

num_cks是最需要推敲的参数。设小了,正常的长延迟事务被误判;设大了,真问题被窗口吞掉。我的做法是先按协议文档的最大延迟取值,再在回归里统计窗口余量,如果失败集中在窗口边界,就说明约束本身卡得太死,该回头改协议假设而不是改断言。

assert_change的start_event和test_expr分工要分清:前者是「什么时候开始数」,后者是「数的时候条件必须满足」。上面例子里mode_wr触发计数,idle && !pending是被检查的条件,写反了语义就变成「只在 idle 时检查 mode_wr」,几乎等于不检查。

3.3 握手与窗口:handshake、frame、cycle_sequence

握手类检查器省掉的最多是手写计数器的那部分代码。原生 SVA 实现一个「req 之后 N 拍到 M 拍之间必须有 ack」,要写##[N:M]加throughout,还得处理复位和重复请求;用库单元,参数里填窗口就行。

// 握手检查:请求发出后,应答必须在窗口内到达,且不应答不能超过 max_latency assert_handshake #( .severity_level (`SVA_ERROR), .msg ("axi 读握手超时:valid 拉高后窗口内无 ready"), .category (CAT_AXI), .coverage_level_i (2) ) u_axi_rd_hs ( .clk (aclk), .reset_n (aresetn), .req (arvalid), .ack (arready) );

不同库版本的握手检查器端口名差异较大,有的叫req/ack,有的叫start_event/test_expr,还有的带独立的窗口端口。抄之前先打开库目录下的源文件确认一遍端口,这一步别省。参数说明上,真正要调的只有窗口值,其余走默认。

assert_frame适合检查「一帧数据」的结构:帧头出现、中间若干拍有效、帧尾收掉。用原生 SVA 写要维护一整套局部变量,用库单元则把起止条件作为参数传入。实际使用时最常见的坑是帧间隔不固定,导致窗口参数怎么调都有漏,这种场景更合适的做法是把帧定义固化成状态机信号,再让检查器只盯状态迁移,而不是让它去猜帧边界。

assert_cycle_sequence处理的是重复出现的短序列,比如「A 拍后 B 拍,B 拍后 C 拍」这种固定节奏。参数里的num_cks描述序列长度,序列本身用表达式组合传入。它比手写##1链可读性好,尤其是在序列会被多个模块复用的时候。

3.4 数据路径:overflow、underflow、delta、parity、fifo_index

数据路径类的检查器在存储控制器和 FIFO 周边用得最多。这类检查器的共同点是参数简单、收益直接:上溢下溢、指针越界、单拍变化量过大、奇偶校验错,这四类问题手写断言容易漏边界条件。

// 计数器上溢:wr_en 有效时计数已到最大值,说明下一拍要绕回 assert_no_overflow #( .severity_level (`SVA_ERROR), .msg ("写指针在 wr_en 有效时已处于最大值"), .category (CAT_MEM) ) u_wr_ovf ( .clk (clk), .reset_n (rst_n), .test_expr (wr_ptr) ); // FIFO 指针合法性:push 时不能满,pop 时不能空 assert_fifo_index #( .severity_level (`SVA_ERROR), .msg ("FIFO 空状态下发生 pop"), .category (CAT_MEM) ) u_fifo_idx ( .clk (clk), .reset_n (rst_n), .push (wr_en), .pop (rd_en) ); // 单拍变化量约束:模拟前端送来的采样值不允许跳变超过阈值 assert_delta #( .severity_level (`SVA_WARNING), .msg ("adc_sample 单拍跳变超过阈值"), .category (CAT_DP) ) u_sample_delta ( .clk (clk), .reset_n (rst_n), .test_expr (adc_sample) );

assert_delta的阈值设定是个权衡。设太松,毛刺漏过去;设太紧,正常量程切换就报错。我的经验是把阈值和量程切换信号绑在一起,切换期间用使能屏蔽,稳态期间才严格判定。奇偶校验和assert_no_transition同理,前者要注意校验位本身的计算时机,后者要明确「多久没翻转才算异常」,否则窗口设错会变成噪声源。

4. 覆盖率等级:coverage_level_i 的三档与报告落地

检查器不只会报错,它还能回答另一个问题:这些检查到底跑到了多少。文档里专门用一章讲覆盖率等级,原因很实际——断言全绿不等于验证充分,可能是压根没激活。

4.1 三档覆盖率在统计什么

coverage_level_i是一个分级开关,取值通常是 0 到 3。0 表示不收集,1 是最粗的一层,主要统计检查器是否被激活过;2 是中间层,会记录条件成立/不成立的分布;3 最细,包含更多边界组合的采样。

分级的动机是性能。一条检查器如果每拍都做细粒度采样,几千条同时跑起来仿真会明显变慢。我一般按重要性分:核心数据通路和协议握手给 2,控制状态机和边界条件给 1,纯辅助性的时序检查给 0。全给 3 的做法在小模块上还行,上了子系统级别,仿真时间会教你做人。

等级设了不等于有数据。覆盖率收集是编译期开关,没打开的话,coverage_level_i填多少都是摆设。这一点文档里写得不算显眼,我第一次用就栽在这里,报告里一片空白,排查了半天以为是库版本问题。

4.2 从编译开关到指示盘:报告怎么读

典型流程是三步:编译打开收集、仿真把数据落库、出报告看分级视图。命令名各工具链不同,下面用占位说明流程,实际用的时候替换成自己环境里的命令。

# 第一步:编译时打开断言覆盖率收集(开关名以手上的仿真器手册为准) <compile_cmd> -sverilog -assert svaext -cm assert -cm_dir ./cov_db -f filelist.f # 第二步:跑一条最小用例,把覆盖率数据落进同一个库 <sim_cmd> +ntb_random_seed=1 -cm assert -cm_dir ./cov_db # 第三步:出文本与网页两份报告,按 category 和实例名聚合 <cov_cmd> -dir ./cov_db -report ./cov_rpt -format both -group_by_assert

第三步的-group_by_assert是关键。默认报告按文件和行号聚合,对检查器来说没什么意义;按检查器实例聚合之后,能直接看出哪个inst_name从来没被激活过。文档里提到的「指示盘」就是把这类信息做成可视化的总览页,红黄绿三色对应不同覆盖等级,先看红的,再逐个钻进去。

读报告的时候盯三个数:激活率、失败率、等级分布。激活率是检查器真正被触发过的比例,一堆 0% 的检查器通常意味着复位屏蔽条件写得太宽,或者enable一直没打开。失败率异常高(比如 30% 以上)多半是误报,先怀疑时钟域和复位时序。等级分布则是看你的分级策略有没有落地,如果所有检查器都停在 1 级,说明细心那部分根本没收集。

4.3 参数化检查与覆盖率收敛

文档里还提到一类参数检查,配合 covergroup 型的库单元使用。它的用途是把边界值、地址区间、长度组合这类离散场景采成覆盖点,和检查器本身的通过/失败统计互补。

实际收敛策略我通常分三层。第一层是全量打开等级 1,跑一次完整回归,把从未激活的检查器挑出来,逐条确认是环境没构造出场景,还是屏蔽条件写错了。第二层对核心通路开到等级 2,看条件分布是否偏斜——如果某个检查器只有「成立」没有「不成立」,那它其实没被真正验证过。第三层只对少数关键检查器开到 3,比如总线协议的握手和存储区的指针合法性,这些地方出错代价最高。

分层的另一个好处是回归时长可控。门禁回归只跑等级 1 和部分等级 2,夜间全量再把等级 3 打开。这套做法不是文档里写的,是被一次通宵回归逼出来的——全部开到最高等级那版,单次回归从 40 分钟涨到 3 小时,最后只能砍。

5. 避坑与排查:五个例化之后才知道的现场

检查器用起来门槛不高,麻烦都在「它到底有没有在工作」这件事上。下面五条都是实际踩过的。

5.1 五条现场记录

现象一:故意把test_expr写成恒假,回归依然全绿。原因:检查器根本没被例化进编译单元,或者例化的层级在一个未被例化或被优化掉的模块里。另一种可能是reset_n接成了常 0,检查器永远停在复位态。解决办法:每次接入新检查器,先做一次故障注入——把条件临时改成必然失败,确认波形和日志里能看到这条错误,再改回来。这一步三十秒,能省掉几小时。

现象二:复位释放后瞬间报出几百条失败,之后正常。原因:复位释放沿附近信号未初始化,或者reset_n是同步复位、释放比预期晚一拍。解决办法:先确认复位极性,再在test_expr里与上初始化完成信号,或用enable端口屏蔽复位后前若干拍。别直接把num_cks调大绕过去,那是把问题藏起来。

现象三:大量与 X 相关的报错,波形上看信号其实正常。原因:仿真初期有未初始化信号,X 通过组合逻辑传染到了被检查表达式里。解决办法:用assert_never单独盯住关键信号的 X/Z 状态,先把 X 源头清掉,再让功能检查器工作。检查器的误报和真报混在一起时,优先处理 X,因为 X 会污染所有下游判定。

现象四:coverage_level_i设成了 2,报告里该检查器覆盖率始终为 0。原因:编译期没打开断言覆盖率收集,或者options里的位掩码把覆盖率采样关掉了。还有一种少见情况是检查器被property_type设成了 cover 之外的类型,导致采样路径不同。解决办法:先查编译开关,再查options,最后用一条最简单的检查器做对照实验,确认收集链路本身是通的。

现象五:检查器数量上去之后,仿真明显变慢。原因:每条检查器每拍都在求值,尤其是带窗口和序列的检查器开销更大。解决办法:分级——核心路径保留细粒度检查和等级 2 覆盖率,辅助性检查降到等级 1 或 0;同时把只在特定测试用例里需要的检查器用宏包起来,按编译开关裁剪。别指望靠加大机器配置解决,问题会随规模线性放大。

5.2 四步排查顺序

出问题时按这个顺序走,比东一榔头西一棒子快。

第一步看编译。检查器的例化位置是否在正确的模块或接口里,端口名是否与库版本匹配,有没有未连接的必填端口。编译能过但端口接错的情况很常见,尤其是位置式例化。

第二步看复位与时钟。用波形确认clk真的在翻转、reset_n的极性和释放时刻符合预期。这两项占了我遇到过的问题里一半以上。

第三步做故障注入。临时把条件改成必然失败,确认检查器会红。不会红就说明它没工作,往回查例化和层级,别急着怀疑设计。

第四步看覆盖率报告。如果检查器工作正常但覆盖率是空的,问题在收集链路而不是检查逻辑。把这三层分清,排查范围能缩小一大半。

6. 进阶:把检查器接进回归门禁的一次改造

检查器写完之后最大的问题是「散」。一个子系统几十个模块,每个模块里例化一堆库单元,风格立刻开始漂移。我的做法是用bind把检查器集中挂载,独立成一个检查文件,模块源码一行不改。

// chk_bus_bind.sv:所有总线检查集中在这里,通过 bind 挂到目标模块 module chk_bus_bind ( input logic aclk, input logic aresetn, input logic arvalid, input logic arready, input logic [7:0] arlen ); // 握手窗口检查 assert_handshake #( .severity_level (`SVA_ERROR), .msg ("ar 握手超过协议窗口"), .category (CAT_AXI), .coverage_level_i (2), .inst_name ("bind_ar_hs") ) u_ar_hs ( .clk (aclk), .reset_n (aresetn), .req (arvalid), .ack (arready) ); // 长度字段:非零传输时长度不许为 0 assert_never #( .severity_level (`SVA_ERROR), .msg ("arlen 为 0 但 arvalid 有效"), .category (CAT_AXI) ) u_arlen_zero ( .clk (aclk), .reset_n (aresetn), .test_expr (arvalid && arlen == 8'd0) ); endmodule // 在顶层或独立的 bind 文件里挂载,目标模块名按实际替换 bind axi_master chk_bus_bind u_chk_bus_bind ( .aclk (aclk), .aresetn (aresetn), .arvalid (arvalid), .arready (arready), .arlen (arlen) );

这样做的好处是检查器和设计解耦:设计改端口,只需要改 bind 那一处;检查器要临时关掉,注释掉 bind 就行,不用动源码。代价是多了一层层级,波形里看信号要展开,且bind的端口列表必须和模块端口严格对齐,漏一个就是编译错误。

门禁这块,我把检查器的severity_level分成两档,回归脚本只卡 error:error 数不为 0 直接失败,warning 数超过阈值才告警。阈值不是拍脑袋定的,先跑一周统计基线,再留 20% 余量。覆盖率门禁只卡两点:核心检查器的激活率必须 100%,等级 2 的检查器不允许出现「只有成立没有不成立」的偏斜。这两条卡住之后,那种「断言全绿但其实没跑」的情况基本消失了。

最后说个习惯。从那以后我每接入一个新检查器,都强制走一遍故障注入,把条件改成必然失败,确认日志里能看到完整的msg、inst_name和时间戳,再改回来。这个动作很傻,但它把「检查器不工作」这类问题挡在了提交之前,比任何排查技巧都管用。希望帮到你。

本文还有配套的精品资源,点击获取